{"text_format":"1","workbook":"xlsx","n_sheets":5,"sheets":["INDICE","ACQUISTI","BUDGET","STAGIONALITA","PREMI"],"not_rendered":{"charts":3,"images":1,"macros":1,"external_links":1,"defined_names":0,"comments":0,"pivot_tables":4},"unopened":[],"bounds":{"document_bytes":16777216,"sheet_cells":100000,"rows_first":2000,"rows_last":500,"rows_between":2000,"halvings":0,"cell_chars":16384,"cell_head_chars":4096},"cells_cut":0,"cells_raw":0,"read":"whole","date_system":"1900"}

{"sheet":"INDICE","index":0,"n_rows":20,"n_cols":4,"rows_kept":20,"cut":false,"hidden":false,"merged":[[0,0,1,10],[9,0,9,2],[3,0,3,3],[4,0,4,2],[7,0,7,2],[6,0,6,2],[8,0,8,2],[5,0,5,2],[18,2,18,4],[19,2,19,4],[14,2,14,3],[12,0,12,4],[16,2,16,4],[17,2,17,4]]}
["CRUSCOTTO DELTA: ANALISI DEGLI ACQUISTI "]
[]
[]
["SINTESI ECONOMICA "]
["FATT. PROGR. 2022",null,null,{"$f":"ACQUISTI!D5","v":3972007.6299999994}]
["BUDGET PROGR. ",null,null,{"$f":"SUM(BUDGET!B4:K62)","v":3537503.612026074}]
["Δ € BDG",null,null,{"$f":"D5-D6","v":434504.01797392545}]
["BUDGET PROGR. 4° TRIM",null,null,{"$f":"IF(MONTH(TODAY())<=3,BUDGET!$U$5,IF(MONTH(TODAY())<=6,BUDGET!$V$5,IF(MONTH(TODAY())<=9,BUDGET!$W$5,BUDGET!$X$5)))","v":4213000}]
["STIMA PREMI MATURATI",null,null,{"$f":"SUM(PREMI!F6:F102)","v":118461.69047500001}]
["% SU FATTURATO",null,null,{"$f":"IFERROR(D9/D5,0)","v":2.9824134671916535E-2}]
{"$rows_left_out":11}
{"sheet":"ACQUISTI","index":1,"n_rows":98,"n_cols":65,"rows_kept":98,"cut":false,"hidden":false,"merged":[[0,24,2,29],[0,7,2,22],[0,1,2,5]]}
[null,"ANALISI FATT. PROGRESSIVO OTTOBRE 2022",null,null,null,null,null,"ANDAMENTO MENSILE 2022",null,null,null,null,null,null,null,null,null,null,null,null,null,null,null,null,"ANDAMENTO MENSILE 2022"]
[]
[]
["SOCIO","FORNITORE","Fatt. Progr.2021 ","Fatt. Progr.2022 ","Δ € Fatt. Progr  ","Δ % Fatt. Progr  ",null,"GRAFICO","SOCIO","FORNITORE","Fatt. Progr.2022 ","GEN 22 ","FEB 22 ","MAR 22 ","APR 22 ","MAG 22 ","GIU 22 ","LUG 22 ","AGO 22 ","SET 22 ","OTT 22 ","NOV 22 ",null,null,"SOCIO","FORNITORE","Fatt. Progr.2022 ","Somma di GEN 21","Somma di FEB 21","Somma di MAR 21","Somma di APR 21","Somma di MAG 21","Somma di GIU 21","Somma di LUG 21","Somma di AGO 21","Somma di SET 21","Somma di OTT 21","Somma di NOV 21","Somma di DIC 21","Somma di GEN 22","Somma di FEB 22","Somma di MAR 22","Somma di APR 22","Somma di MAG 22","Somma di GIU 22","Somma di LUG 22","Somma di AGO 22","Somma di SET 22","Somma di OTT 22","Somma di NOV 22",null,null,null,"GEN","FEB","MAR","APR","MAG","GIU","LUG","AGO","SET","OTT","NOV ","DIC"]
["VIRLINZI SPA",null,4014734,3972007.6299999994,-42726.370000000577,-1.064239125182409E-2,null,null,"VIRLINZI SPA",null,3972007.6299999994,270036.52999999997,344920.56,605316.84,414517.82,562372,504231.23999999993,351612.01,201941.74999999994,395003.05000000016,322055.83000000007,null,null,null,"VIRLINZI SPA",null,3972007.6299999994,245671.84999999998,382083.98,522373.07999999996,620434.19999999995,487423.44,459431.50999999989,405442.6,157389.12999999995,405196.03200000012,329288.17799999996,null,null,270036.52999999997,344920.56,605316.84,414517.82,562372,504231.23999999993,351612.01,201941.74999999994,395003.05000000016,322055.83000000007,null,null,null,2021,{"$f":"AB5","v":245671.84999999998},{"$f":"AC5","v":382083.98},522373.07999999996,620434.19999999995,487423.44,459431.50999999989,405442.6,157389.12999999995,405196.03200000012,329288.17799999996,0,0]
[null,"Tenaris Dalmine ",583236.96,701116.29,117879.33000000007,0.20211224268091676,null,null,null,"Tenaris Dalmine ",701116.29,38203.94,70115.459999999992,86473.459999999992,32895.75,116573.51000000001,62997.119999999995,72468.660000000033,19094.839999999967,155865.37,46428.180000000051,null,null,null,null,"Albatros",2640,1145,38,1055,0,931,2034,1117,0,0,2319,null,null,0,0,1208,0,1168,0,0,0,264,0,null,null,null,2022,{"$f":"AN5","v":270036.52999999997},{"$f":"AO5","v":344920.56},605316.84,414517.82,562372,504231.23999999993,351612.01,201941.74999999994,395003.05000000016,322055.83000000007,0,0]
[null,"Unidelta",702792.73,513325.87,-189466.86,-0.26959137724717219,null,null,null,"Unidelta",513325.87,33528.5,41154.229999999996,81001.86,108171.51999999999,65408.630000000005,58973.710000000021,3560.9099999999744,25250.440000000002,32291.400000000023,63984.669999999984,null,null,null,null,"Arbi arredobagno",0,null,0,0,0,0,0,0,0,0,0,null,null,null,0,0,0,0,0,0,0,0,0]
[null,"Polieco",346399.12,404686.45,58287.330000000016,0.16826639166981727,null,null,null,"Polieco",404686.45,20578.400000000001,52701.49,44386.710000000006,19484.910000000003,37970.25,44612.609999999986,63393.669999999984,43998.160000000033,30403.659999999974,47156.590000000026,null,null,null,null,"Arblu",0,null,0,0,0,0,0,0,0,0,0,null,null,null,0,0,0,0,0,0,0,0,0]
[null,"Isoclima",225391.01,277736.08,52345.070000000007,0.23224116170383202,null,null,null,"Isoclima",277736.08,15333.07,6958.7000000000007,77432.649999999994,58444.840000000011,32734.489999999991,21172.100000000006,11770.51999999999,27133.239999999991,23656.790000000037,3099.679999999993,null,null,null,null,"Ariston ",204698.19000000003,9405.51,17528.769999999997,27469.66,32388.360000000008,33123.22,34219.90999999996,29736.290000000037,3514.3899999999849,40963.06,22546.139999999985,null,null,10927.03,19120.159999999996,28651.830000000005,17453.199999999997,51916.39,22480.559999999983,3847.570000000007,32519.789999999979,13893.540000000037,3888.1200000000244]
[null,"Wavin ",228191.19999999998,266250.21999999997,38059.01999999999,0.16678566044615217,null,null,null,"Wavin ",266250.21999999997,26864.41,20025.890000000003,35379.860000000088,37992.099999999919,44508.399999999994,20783.839999999997,21839.309999999998,4740.6900000000023,26235.670000000013,27880.049999999959,null,null,null,null,"Arredamenti Montegrappa",0,null,0,1399.29,0,0,0,0,0,0,0,null,null,null,0,0,0,0,0,0,0,0,0]
{"$rows_left_out":89}
{"sheet":"BUDGET","index":2,"n_rows":113,"n_cols":24,"rows_kept":113,"cut":false,"hidden":false,"merged":[[1,0,1,8],[0,14,1,15]]}
[null,null,null,null,null,null,null,null,null,null,null,null,null,null,"BUDGET  ANNUALE DEGLI ACQUISTI"]
["BUDGET MENSILE DEGLI ACQUISTI"]
["FORNITORE","GEN 22","FEB 22","MAR 22","APR 22","MAG 22","GIU 22","LUG 22","AGO 22","SET 22","OTT 22","NOV 22","DIC 22",null,"FORNITORE","BUDGET 2022",null,null,null,null,"GEN-MAR","APR-GIU","LUG-SET","OTT-DIC"]
[{"$f":"IF(O4=0,\"\",O4)","v":"Unidelta"},{"$f":"IFERROR(VLOOKUP(A4,STAGIONALITA!$A$3:$M$105,2,FALSE)*P4,\"\")","v":0},{"$f":"IFERROR(VLOOKUP(A4,STAGIONALITA!$A$3:$M$105,3,FALSE)*P4,\"\")","v":130440.47416339679},{"$f":"IFERROR(VLOOKUP(A4,STAGIONALITA!$A$3:$M$105,4,FALSE)*P4,\"\")","v":63901.462639093297},{"$f":"IFERROR(VLOOKUP(A4,STAGIONALITA!$A$3:$M$105,5,FALSE)*P4,\"\")","v":78851.681084068405},{"$f":"IFERROR(VLOOKUP(A4,STAGIONALITA!$A$3:$M$105,6,FALSE)*P4,\"\")","v":57542.33302224669},{"$f":"IFERROR(VLOOKUP(A4,STAGIONALITA!$A$3:$M$105,7,FALSE)*P4,\"\")","v":68031.677794028641},{"$f":"IFERROR(VLOOKUP(A4,STAGIONALITA!$A$3:$M$105,8,FALSE)*P4,\"\")","v":61055.53161231683},{"$f":"IFERROR(VLOOKUP(A4,STAGIONALITA!$A$3:$M$105,9,FALSE)*P4,\"\")","v":16887.430756612048},{"$f":"IFERROR(VLOOKUP(A4,STAGIONALITA!$A$3:$M$105,10,FALSE)*P4,\"\")","v":36810.786164103003},{"$f":"IFERROR(VLOOKUP(A4,STAGIONALITA!$A$3:$M$105,11,FALSE)*P4,\"\")","v":61072.157712613982},{"$f":"IFERROR(VLOOKUP(A4,STAGIONALITA!$A$3:$M$105,12,FALSE)*P4,\"\")","v":62990.223477898166},{"$f":"IFERROR(VLOOKUP(A4,STAGIONALITA!$A$3:$M$105,13,FALSE)*P4,\"\")","v":12416.241573622106},null,"Unidelta",650000,null,null,null,"ACQUISTI",{"$f":"ACQUISTI!L5+ACQUISTI!M5+ACQUISTI!N5","v":1220273.93},{"$f":"U4+ACQUISTI!O5+ACQUISTI!P5+ACQUISTI!Q5","v":2701394.9899999998},{"$f":"V4+ACQUISTI!R5+ACQUISTI!S5+ACQUISTI!T5","v":3649951.8000000003},{"$f":"W4+ACQUISTI!U5+ACQUISTI!V5+ACQUISTI!W5","v":3972007.6300000004}]
["Tenaris Dalmine ",{"$f":"IFERROR(VLOOKUP(A5,STAGIONALITA!$A$3:$M$105,2,FALSE)*P5,\"\")","v":19930.150984477845},{"$f":"IFERROR(VLOOKUP(A5,STAGIONALITA!$A$3:$M$105,3,FALSE)*P5,\"\")","v":27800.167409854377},{"$f":"IFERROR(VLOOKUP(A5,STAGIONALITA!$A$3:$M$105,4,FALSE)*P5,\"\")","v":58984.318523927912},{"$f":"IFERROR(VLOOKUP(A5,STAGIONALITA!$A$3:$M$105,5,FALSE)*P5,\"\")","v":94673.140248604526},{"$f":"IFERROR(VLOOKUP(A5,STAGIONALITA!$A$3:$M$105,6,FALSE)*P5,\"\")","v":66269.295378377341},{"$f":"IFERROR(VLOOKUP(A5,STAGIONALITA!$A$3:$M$105,7,FALSE)*P5,\"\")","v":46887.938206640298},{"$f":"IFERROR(VLOOKUP(A5,STAGIONALITA!$A$3:$M$105,8,FALSE)*P5,\"\")","v":54758.417836594286},{"$f":"IFERROR(VLOOKUP(A5,STAGIONALITA!$A$3:$M$105,9,FALSE)*P5,\"\")","v":1175.2840985535572},{"$f":"IFERROR(VLOOKUP(A5,STAGIONALITA!$A$3:$M$105,10,FALSE)*P5,\"\")","v":51079.775073139383},{"$f":"IFERROR(VLOOKUP(A5,STAGIONALITA!$A$3:$M$105,11,FALSE)*P5,\"\")","v":54878.332968982926},{"$f":"IFERROR(VLOOKUP(A5,STAGIONALITA!$A$3:$M$105,12,FALSE)*P5,\"\")","v":98946.897282546342},{"$f":"IFERROR(VLOOKUP(A5,STAGIONALITA!$A$3:$M$105,13,FALSE)*P5,\"\")","v":24616.281988301194},null,"Tenaris Dalmine ",600000,null,null,null,"BUDGET",{"$f":"SUM(B4:D107)","v":978527.72415715328},{"$f":"U5+SUM(E4:G107)","v":2290122.0294712665},{"$f":"V5+SUM(H4:J107)","v":3166793.5417304528},{"$f":"W5+SUM(K4:M107)","v":4213000}]
["Polieco",{"$f":"IFERROR(VLOOKUP(A6,STAGIONALITA!$A$3:$M$105,2,FALSE)*P6,\"\")","v":12728.344054240246},{"$f":"IFERROR(VLOOKUP(A6,STAGIONALITA!$A$3:$M$105,3,FALSE)*P6,\"\")","v":50510.785445099005},{"$f":"IFERROR(VLOOKUP(A6,STAGIONALITA!$A$3:$M$105,4,FALSE)*P6,\"\")","v":42869.047224202986},{"$f":"IFERROR(VLOOKUP(A6,STAGIONALITA!$A$3:$M$105,5,FALSE)*P6,\"\")","v":44373.200545875094},{"$f":"IFERROR(VLOOKUP(A6,STAGIONALITA!$A$3:$M$105,6,FALSE)*P6,\"\")","v":61700.120891638646},{"$f":"IFERROR(VLOOKUP(A6,STAGIONALITA!$A$3:$M$105,7,FALSE)*P6,\"\")","v":68930.604502845337},{"$f":"IFERROR(VLOOKUP(A6,STAGIONALITA!$A$3:$M$105,8,FALSE)*P6,\"\")","v":66516.503844644642},{"$f":"IFERROR(VLOOKUP(A6,STAGIONALITA!$A$3:$M$105,9,FALSE)*P6,\"\")","v":8674.8453443856706},{"$f":"IFERROR(VLOOKUP(A6,STAGIONALITA!$A$3:$M$105,10,FALSE)*P6,\"\")","v":41273.201618858133},{"$f":"IFERROR(VLOOKUP(A6,STAGIONALITA!$A$3:$M$105,11,FALSE)*P6,\"\")","v":15556.120753728092},{"$f":"IFERROR(VLOOKUP(A6,STAGIONALITA!$A$3:$M$105,12,FALSE)*P6,\"\")","v":58516.382639774973},{"$f":"IFERROR(VLOOKUP(A6,STAGIONALITA!$A$3:$M$105,13,FALSE)*P6,\"\")","v":28350.843134707135},null,"Polieco",500000,null,null,null,"Δ € ",{"$f":"U4-U5","v":241746.20584284666},{"$f":"V4-V5","v":411272.96052873321},{"$f":"W4-W5","v":483158.25826954748},{"$f":"X4-X5","v":-240992.36999999965}]
["Wavin ",{"$f":"IFERROR(VLOOKUP(A7,STAGIONALITA!$A$3:$M$105,2,FALSE)*P7,\"\")","v":14867.386375302161},{"$f":"IFERROR(VLOOKUP(A7,STAGIONALITA!$A$3:$M$105,3,FALSE)*P7,\"\")","v":26403.360317311544},{"$f":"IFERROR(VLOOKUP(A7,STAGIONALITA!$A$3:$M$105,4,FALSE)*P7,\"\")","v":24615.591089748195},{"$f":"IFERROR(VLOOKUP(A7,STAGIONALITA!$A$3:$M$105,5,FALSE)*P7,\"\")","v":43386.716243824303},{"$f":"IFERROR(VLOOKUP(A7,STAGIONALITA!$A$3:$M$105,6,FALSE)*P7,\"\")","v":22630.425542384408},{"$f":"IFERROR(VLOOKUP(A7,STAGIONALITA!$A$3:$M$105,7,FALSE)*P7,\"\")","v":17379.072648290192},{"$f":"IFERROR(VLOOKUP(A7,STAGIONALITA!$A$3:$M$105,8,FALSE)*P7,\"\")","v":10316.577087491667},{"$f":"IFERROR(VLOOKUP(A7,STAGIONALITA!$A$3:$M$105,9,FALSE)*P7,\"\")","v":11386.021856185514},{"$f":"IFERROR(VLOOKUP(A7,STAGIONALITA!$A$3:$M$105,10,FALSE)*P7,\"\")","v":19309.950944221699},{"$f":"IFERROR(VLOOKUP(A7,STAGIONALITA!$A$3:$M$105,11,FALSE)*P7,\"\")","v":21419.943160907649},{"$f":"IFERROR(VLOOKUP(A7,STAGIONALITA!$A$3:$M$105,12,FALSE)*P7,\"\")","v":22331.641262147587},{"$f":"IFERROR(VLOOKUP(A7,STAGIONALITA!$A$3:$M$105,13,FALSE)*P7,\"\")","v":15953.313472185111},null,"Wavin ",250000]
["Raccorderie Metalliche  ",{"$f":"IFERROR(VLOOKUP(A8,STAGIONALITA!$A$3:$M$105,2,FALSE)*P8,\"\")","v":17996.030371189623},{"$f":"IFERROR(VLOOKUP(A8,STAGIONALITA!$A$3:$M$105,3,FALSE)*P8,\"\")","v":14622.880789352686},{"$f":"IFERROR(VLOOKUP(A8,STAGIONALITA!$A$3:$M$105,4,FALSE)*P8,\"\")","v":28733.739110984086},{"$f":"IFERROR(VLOOKUP(A8,STAGIONALITA!$A$3:$M$105,5,FALSE)*P8,\"\")","v":22507.875880752064},{"$f":"IFERROR(VLOOKUP(A8,STAGIONALITA!$A$3:$M$105,6,FALSE)*P8,\"\")","v":21112.669160318623},{"$f":"IFERROR(VLOOKUP(A8,STAGIONALITA!$A$3:$M$105,7,FALSE)*P8,\"\")","v":29786.015831790333},{"$f":"IFERROR(VLOOKUP(A8,STAGIONALITA!$A$3:$M$105,8,FALSE)*P8,\"\")","v":27629.388972424851},{"$f":"IFERROR(VLOOKUP(A8,STAGIONALITA!$A$3:$M$105,9,FALSE)*P8,\"\")","v":8233.508220352669},{"$f":"IFERROR(VLOOKUP(A8,STAGIONALITA!$A$3:$M$105,10,FALSE)*P8,\"\")","v":14347.371848243463},{"$f":"IFERROR(VLOOKUP(A8,STAGIONALITA!$A$3:$M$105,11,FALSE)*P8,\"\")","v":24196.489170011562},{"$f":"IFERROR(VLOOKUP(A8,STAGIONALITA!$A$3:$M$105,12,FALSE)*P8,\"\")","v":16860.400392688047},{"$f":"IFERROR(VLOOKUP(A8,STAGIONALITA!$A$3:$M$105,13,FALSE)*P8,\"\")","v":13973.630251891984},null,"Raccorderie Metalliche  ",240000]
["Ariston ",{"$f":"IFERROR(VLOOKUP(A9,STAGIONALITA!$A$3:$M$105,2,FALSE)*P9,\"\")","v":17631.574108532503},{"$f":"IFERROR(VLOOKUP(A9,STAGIONALITA!$A$3:$M$105,3,FALSE)*P9,\"\")","v":26880.574721188495},{"$f":"IFERROR(VLOOKUP(A9,STAGIONALITA!$A$3:$M$105,4,FALSE)*P9,\"\")","v":21328.344847754062},{"$f":"IFERROR(VLOOKUP(A9,STAGIONALITA!$A$3:$M$105,5,FALSE)*P9,\"\")","v":21650.635068913743},{"$f":"IFERROR(VLOOKUP(A9,STAGIONALITA!$A$3:$M$105,6,FALSE)*P9,\"\")","v":20570.835355872747},{"$f":"IFERROR(VLOOKUP(A9,STAGIONALITA!$A$3:$M$105,7,FALSE)*P9,\"\")","v":23090.064944243339},{"$f":"IFERROR(VLOOKUP(A9,STAGIONALITA!$A$3:$M$105,8,FALSE)*P9,\"\")","v":19307.185447507931},{"$f":"IFERROR(VLOOKUP(A9,STAGIONALITA!$A$3:$M$105,9,FALSE)*P9,\"\")","v":3112.8324489811453},{"$f":"IFERROR(VLOOKUP(A9,STAGIONALITA!$A$3:$M$105,10,FALSE)*P9,\"\")","v":18110.86264694692},{"$f":"IFERROR(VLOOKUP(A9,STAGIONALITA!$A$3:$M$105,11,FALSE)*P9,\"\")","v":22456.379423015896},{"$f":"IFERROR(VLOOKUP(A9,STAGIONALITA!$A$3:$M$105,12,FALSE)*P9,\"\")","v":13456.471436103186},{"$f":"IFERROR(VLOOKUP(A9,STAGIONALITA!$A$3:$M$105,13,FALSE)*P9,\"\")","v":12404.239550940032},null,"Ariston ",220000]
["Haier ",{"$f":"IFERROR(VLOOKUP(A10,STAGIONALITA!$A$3:$M$105,2,FALSE)*P10,\"\")","v":0},{"$f":"IFERROR(VLOOKUP(A10,STAGIONALITA!$A$3:$M$105,3,FALSE)*P10,\"\")","v":17711.658405733015},{"$f":"IFERROR(VLOOKUP(A10,STAGIONALITA!$A$3:$M$105,4,FALSE)*P10,\"\")","v":27614.101957989955},{"$f":"IFERROR(VLOOKUP(A10,STAGIONALITA!$A$3:$M$105,5,FALSE)*P10,\"\")","v":31106.786878278246},{"$f":"IFERROR(VLOOKUP(A10,STAGIONALITA!$A$3:$M$105,6,FALSE)*P10,\"\")","v":48809.867330378518},{"$f":"IFERROR(VLOOKUP(A10,STAGIONALITA!$A$3:$M$105,7,FALSE)*P10,\"\")","v":6418.2138241898374},{"$f":"IFERROR(VLOOKUP(A10,STAGIONALITA!$A$3:$M$105,8,FALSE)*P10,\"\")","v":37450.78631412136},{"$f":"IFERROR(VLOOKUP(A10,STAGIONALITA!$A$3:$M$105,9,FALSE)*P10,\"\")","v":15520.520661154775},{"$f":"IFERROR(VLOOKUP(A10,STAGIONALITA!$A$3:$M$105,10,FALSE)*P10,\"\")","v":4052.942427353215},{"$f":"IFERROR(VLOOKUP(A10,STAGIONALITA!$A$3:$M$105,11,FALSE)*P10,\"\")","v":-1190.1770001312252},{"$f":"IFERROR(VLOOKUP(A10,STAGIONALITA!$A$3:$M$105,12,FALSE)*P10,\"\")","v":9514.4697511789909},{"$f":"IFERROR(VLOOKUP(A10,STAGIONALITA!$A$3:$M$105,13,FALSE)*P10,\"\")","v":2990.8294497533466},null,"Haier ",200000]
{"$rows_left_out":104}
{"sheet":"STAGIONALITA","index":3,"n_rows":96,"n_cols":42,"rows_kept":96,"cut":false,"hidden":false,"merged":[[0,0,0,12],[0,29,0,41]]}
["STAGIONALITA' 2021 GRUPPO DELTA"]
["Fornitori","GEN 21 ","FEB 21 ","MAR 21 ","APR 21 ","MAG 21 ","GIU 21","LUG 21 ","AGO 21 ","SET 21 ","OTT 21 ","NOV 21 ","DIC 21 ",null,null,"Socio","GEN 21 ","FEB 21 ","MAR 21 ","APR 21 ","MAG 21 ","GIU 21","LUG 21 ","AGO 21 ","SET 21 ","OTT 21 ","NOV 21 ","DIC 21 ",null,null,"GEN 21 ","FEB 21 ","MAR 21 ","APR 21 ","MAG 21 ","GIU 21","LUG 21 ","AGO 21 ","SET 21 ","OTT 21 ","NOV 21 ","DIC 21 "]
["Albatros",6.5824738952378909E-3,5.6712193657668473E-3,0.2138982396706619,5.442869701322927E-2,0.16969703467055469,7.5258903492785006E-3,0.13854285040416819,5.9574604944359871E-2,9.9326743712343749E-2,1.0999378202791656E-2,0.11247025021977315,0.1212826175518343,null,null,"CALLIPO Srl",5.023261877495163E-2,9.9261228627445242E-2,6.0295547692397075E-2,0.11061881850026933,6.9790380308053429E-2,9.5386250649836787E-2,0.10048755325695176,2.3424727775072172E-2,8.9364973371552872E-2,9.3905159629456725E-2,0.12599385919671852,8.1238882217294375E-2,null,"DELTA",5.6919649382350716E-2,9.8672681628164255E-2,9.6385500020043854E-2,9.1485996761555652E-2,8.2609683240008822E-2,9.3939631900102086E-2,8.7493676949499097E-2,2.9994697538913845E-2,8.6082240288608655E-2,0.10633675961254326,0.10168845522185693,6.8391027456352907E-2]
["Arbi Arredobagno",5.100171884245823E-3,6.9401786469046753E-2,9.2366648820761357E-2,5.3763137873707345E-2,7.8925864352334521E-2,0.1184028854011102,6.9937163628166474E-2,7.4811913550677678E-2,8.6139367127842426E-2,4.0998619290484373E-2,0.20843078136887486,0.10172166023274817,null,null,"CASAÉ F.lli LARUFFA srl",6.846732325539634E-2,0.10155942142189887,7.9259182751148113E-2,5.8382358694262594E-2,4.7944683253418996E-2,6.8699004608255676E-2,0.17514740345505417,3.6480139224877382E-2,6.4841773617822007E-2,0.12057264611565442,7.4449363940239446E-2,0.10419669966197175,null,{"$f":"ACQUISTI!A5","v":"VIRLINZI SPA"},{"$f":"VLOOKUP($AD$4,$P$2:$AB$23,2,FALSE)","v":3.8218617217752625E-2},{"$f":"VLOOKUP($AD$4,$P$2:$AB$23,3,FALSE)","v":9.2963360172913373E-2},{"$f":"VLOOKUP($AD$4,$P$2:$AB$23,4,FALSE)","v":9.7482898753236902E-2},{"$f":"VLOOKUP($AD$4,$P$2:$AB$23,5,FALSE)","v":0.12567107518049808},{"$f":"VLOOKUP($AD$4,$P$2:$AB$23,6,FALSE)","v":0.10007833175366979},{"$f":"VLOOKUP($AD$4,$P$2:$AB$23,7,FALSE)","v":0.10976216046663954},{"$f":"VLOOKUP($AD$4,$P$2:$AB$23,8,FALSE)","v":8.3606142201942082E-2},{"$f":"VLOOKUP($AD$4,$P$2:$AB$23,9,FALSE)","v":3.0952645518421869E-2},{"$f":"VLOOKUP($AD$4,$P$2:$AB$23,10,FALSE)","v":8.3909938615840396E-2},{"$f":"VLOOKUP($AD$4,$P$2:$AB$23,11,FALSE)","v":7.1116121874806815E-2},{"$f":"VLOOKUP($AD$4,$P$2:$AB$23,12,FALSE)","v":9.3408467273161294E-2},{"$f":"VLOOKUP($AD$4,$P$2:$AB$23,13,FALSE)","v":7.2830240971117205E-2}]
["Arblu",4.1826374572185812E-2,6.9876167432293315E-2,0.11367076780299863,0.10293303694971385,7.5748552989291687E-2,0.10491476320273048,0.1176450050651676,2.3321699583297925E-2,0.10156076647433536,7.0969220415240578E-2,8.3320341421968036E-2,9.4213304090776676E-2,null,null,"COICO +3 snc",4.9275150044262861E-2,9.2414721982734441E-2,8.8153259001393369E-2,0.12234848023271591,7.9538343626965366E-2,6.0980264087094775E-2,0.11408905718026761,1.8382688108255295E-2,7.6536248877856206E-2,0.13908224547355999,0.12260916351515931,3.6590377869734819E-2]
["Ariston ",8.014351867514774E-2,0.1221844305508568,9.6947022035245745E-2,9.8411977585971561E-2,9.3503797072148842E-2,0.10495484065565154,8.7759933852308777E-2,1.4149238404459752E-2,8.2322102940667816E-2,0.10207445192279953,6.1165779255014478E-2,5.638290704972742E-2,null,null,"COLONNA SAVERIO srl",4.0311718860245704E-2,9.1487690593948831E-2,8.9997331413197892E-2,8.4853357395302573E-2,5.3408274998749596E-2,0.1039265732560069,6.7018739177546638E-2,3.4430133123030199E-2,5.8215739472028037E-2,0.11813462293444954,0.12638800038534684,0.13182781839014757]
["Arredamenti Montegrappa",0.11033570951517713,3.2957596739678609E-2,0.13291707815131154,3.7165582247158435E-2,5.639394476337517E-2,0.19369929755389165,4.213375594923157E-2,2.973097887705272E-2,0.18942687881720419,7.697850284435534E-2,2.4297522914067157E-2,7.3963151627496629E-2,null,null,"DELIZIA ALESSANDRO srl",4.7000490303349178E-2,8.5312782757202124E-2,0.12304299568997559,5.494853181028822E-2,0.11088827842286746,7.0120049179812752E-2,6.2160997746822648E-2,5.4562621847534677E-3,0.11605193374081847,0.182042858829362,4.0300106474825001E-2,0.10267471285992312]
["Atusa",5.6371023468408971E-2,6.8313433774368909E-2,8.1946902429789956E-2,5.8097404013741569E-2,6.8139936234995091E-2,0.11781256898352496,7.7080266850748452E-2,4.8328942213589188E-2,0,0.13587615577689141,0.12341717754124022,0.16461618871270128,null,null,"F.LLI CARERE Srl",5.5927019970074189E-2,8.0487642367746276E-2,6.1625022339553838E-2,4.5597259832448375E-2,0.10922384955192022,9.7544475892116442E-2,9.9907618333076986E-2,3.7017561225955037E-2,0.10097786352012457,0.12271155876131101,0.10719817244747755,8.1781955758195246E-2]
["Bernasconi ",0.13548624099059325,5.6484108680029878E-2,6.7513459687043254E-2,6.4844088175818063E-2,6.9769752997169879E-2,0.19693477299559431,0.11597818941169558,2.0025770328964819E-2,0.10580812109964768,6.6151057525400722E-2,5.1433868247618343E-2,4.9570569860424171E-2,null,null,"F.LLI CRUSCO srl",5.5535151190686381E-2,0.12435948212048548,0.14141764707505619,0.15015142830637576,5.1881384666896103E-2,0.12165902924220799,5.8253419396078865E-2,3.0953012025354755E-2,4.6180964102243989E-2,8.6406896923150442E-2,7.4404991723237363E-2,5.8796593228226682E-2]
["Beza",0,0,0,0,0,0,0,0,0,0,0,1,null,null,"F.LLI ZANGRILLO srl",4.7743139800552101E-2,8.1347343740324429E-2,7.0297383811266906E-2,9.7048483858796358E-2,0.10980759314427344,0.11922943419768023,8.54698998185415E-2,5.0019004686209484E-2,9.476053462651321E-2,9.3123323983516249E-2,7.9904647969285342E-2,7.1249210363040633E-2]
{"$rows_left_out":87}
{"sheet":"PREMI","index":4,"n_rows":102,"n_cols":6,"rows_kept":102,"cut":false,"hidden":false,"merged":[[0,1,2,5]]}
[null,"STIMA PREMI AD OGGI"]
[]
[]
["SOCIO","FORNITORE","Fatt. Progr.2022 ","Incondizionato","Premio a Target","Totale premi"]
["VIRLINZI SPA",null,3972038.44,null,null,{"$f":"SUM(F6:F102)","v":118461.69047500001}]
[null,"Albatros",2640,{"$f":"IFERROR(VLOOKUP(B6,'[1]FATT+ORD+P.O.'!$A$3:$I$96,6,FALSE),\"\")","v":0},{"$f":"IFERROR(VLOOKUP(B6,'[1]FATT+ORD+P.O.'!$A$3:$I$96,7,FALSE),\"\")","v":0},{"$f":"IFERROR(C6*(D6+E6),\"\")","v":0}]
[null,"Ariston ",204698.19000000003,{"$f":"IFERROR(VLOOKUP(B7,'[1]FATT+ORD+P.O.'!$A$3:$I$96,6,TRUE),\"\")","v":0},{"$f":"IFERROR(VLOOKUP(B7,'[1]FATT+ORD+P.O.'!$A$3:$I$96,7,TRUE),\"\")","v":0},{"$f":"IFERROR(C7*(D7+E7),\"\")","v":0}]
[null,"Atusa",1378.04,{"$f":"IFERROR(VLOOKUP(B8,'[1]FATT+ORD+P.O.'!$A$3:$I$96,6,FALSE),\"\")","v":0.1},{"$f":"IFERROR(VLOOKUP(B8,'[1]FATT+ORD+P.O.'!$A$3:$I$96,7,FALSE),\"\")","v":0},137.804]
[null,"Bmeters",9983.8700000000008,{"$f":"IFERROR(VLOOKUP(B9,'[1]FATT+ORD+P.O.'!$A$3:$I$96,6,FALSE),\"\")","v":0},{"$f":"IFERROR(VLOOKUP(B9,'[1]FATT+ORD+P.O.'!$A$3:$I$96,7,FALSE),\"\")","v":0.02},199.67740000000003]
[null,"Bosch",142477.16,{"$f":"IFERROR(VLOOKUP(B10,'[1]FATT+ORD+P.O.'!$A$3:$I$96,6,FALSE),\"\")","v":0},{"$f":"IFERROR(VLOOKUP(B10,'[1]FATT+ORD+P.O.'!$A$3:$I$96,7,FALSE),\"\")","v":0},0]
{"$rows_left_out":92}