{"text_format":"1","workbook":"xlsx","n_sheets":5,"sheets":["INDICE","ACQUISTI","BUDGET","STAGIONALITA","PREMI"],"not_rendered":{"charts":2,"images":1,"macros":1,"external_links":1,"defined_names":0,"comments":0,"pivot_tables":4},"unopened":[],"bounds":{"document_bytes":16777216,"sheet_cells":100000,"rows_first":2000,"rows_last":500,"rows_between":2000,"halvings":0,"cell_chars":16384,"cell_head_chars":4096},"cells_cut":0,"cells_raw":0,"read":"whole","date_system":"1900"}

{"sheet":"INDICE","index":0,"n_rows":19,"n_cols":4,"rows_kept":19,"cut":false,"hidden":false,"merged":[[17,2,17,4],[18,2,18,4],[13,2,13,3],[11,0,11,4],[15,2,15,4],[16,2,16,4],[0,0,1,10],[8,0,8,2],[3,0,3,3],[4,0,4,2],[5,0,5,2],[6,0,6,2],[7,0,7,2]]}
["CRUSCOTTO DELTA: ANALISI DEGLI ACQUISTI "]
[]
[]
["SINTESI ECONOMICA "]
["FATT. PROGR. 2022",null,null,{"$f":"ACQUISTI!D5","v":1033305.776}]
["BUDGET PROGR. TRIMEST.",null,null,{"$f":"IF(MONTH(TODAY())<=3,BUDGET!$U$5,IF(MONTH(TODAY())<=6,BUDGET!$V$5,IF(MONTH(TODAY())<=9,BUDGET!$W$5,BUDGET!$X$5)))","v":2099470.3480083193}]
["Δ € BDG",null,null,{"$f":"D5-D6","v":-1066164.5720083192}]
["STIMA PREMI MATURATI",null,null,{"$f":"SUM(PREMI!G6:G102)","v":0}]
["% SU FATTURATO",null,null,{"$f":"IFERROR(D8/D5,0)","v":0}]
[]
{"$rows_left_out":10}
{"sheet":"ACQUISTI","index":1,"n_rows":96,"n_cols":65,"rows_kept":96,"cut":false,"hidden":false,"merged":[[0,0,2,5],[0,24,2,29],[0,7,2,22]]}
["ANALISI FATT. PROGRESSIVO 2022",null,null,null,null,null,null,"ANDAMENTO MENSILE 2022",null,null,null,null,null,null,null,null,null,null,null,null,null,null,null,null,"ANDAMENTO MENSILE 2022"]
[]
[]
["SOCIO","FORNITORE","Fatt. Progr.2021 ","Fatt. Progr.2022 ","Δ € Fatt. Progr  ","Δ % Fatt. Progr  ",null,"GRAFICO","SOCIO","FORNITORE","Fatt. Progr.2022 ","GEN 22 ","FEB 22 ","MAR 22 ","APR 22 ","MAG 22 ","GIU 22 ","LUG 22 ","AGO 22 ","SET 22 ","OTT 22 ","NOV 22 ","DIC 22 ",null,"SOCIO","FORNITORE","Fatt. Progr.2022 ","Somma di GEN 21","Somma di FEB 21","Somma di MAR 21","Somma di APR 21","Somma di MAG 21","Somma di GIU 21","Somma di LUG 21","Somma di AGO 21","Somma di SET 21","Somma di OTT 21","Somma di NOV 21","Somma di DIC 21","Somma di GEN 22","Somma di FEB 22","Somma di MAR 22","Somma di APR 22","Somma di MAG 22","Somma di GIU 22","Somma di LUG 22","Somma di AGO 22","Somma di SET 22","Somma di OTT 22","Somma di NOV 22","Somma di DIC 22",null,null,"GEN","FEB","MAR","APR","MAG","GIU","LUG","AGO","SET","OTT","NOV ","DIC"]
["RAFFAELE SpA",null,661942.46509130427,1033305.776,371363.31090869568,0.56102052745244579,null,null,"RAFFAELE SpA",null,1033305.776,1033305.776,null,null,null,null,null,null,null,null,null,null,null,null,"RAFFAELE SpA",null,1033305.776,661942.46509130427,null,null,null,null,null,null,null,null,null,null,null,1033305.776,null,null,null,null,null,null,null,null,null,null,null,null,2021,{"$f":"AB5","v":661942.46509130427},{"$f":"AC5","v":0},0,0,0,0,0,0,0,0,0,0]
[null,"Geberit",41022.019999999997,149260.83000000002,108238.81000000003,2.6385538791117558,null,null,null,"Geberit",149260.83000000002,149260.83000000002,null,null,null,null,null,null,null,null,null,null,null,null,null,"Albatros",0,null,null,null,null,null,null,null,null,null,null,null,null,null,null,null,null,null,null,null,null,null,null,null,null,null,2022,{"$f":"AN5","v":1033305.776},{"$f":"AO5","v":0},0,0,0,0,0,0,0,0,0,0]
[null,"General Fittings ",28373.897391304308,132901.34,104527.44260869568,3.6839296754745439,null,null,null,"General Fittings ",132901.34,132901.34,null,null,null,null,null,null,null,null,null,null,null,null,null,"Arbi arredobagno",0]
[null,"Immergas ",0,124928.85,124928.85,{"$error":"#DIV/0!"},null,null,null,"Immergas ",124928.85,124928.85,null,null,null,null,null,null,null,null,null,null,null,null,null,"Arblu",8399.7800000000007,7730.32,null,null,null,null,null,null,null,null,null,null,null,8399.7800000000007]
[null,"Carlo Nobili ",0,84309,84309,{"$error":"#DIV/0!"},null,null,null,"Carlo Nobili ",84309,84309,null,null,null,null,null,null,null,null,null,null,null,null,null,"Ariston ",39569.51,86877.25,null,null,null,null,null,null,null,null,null,null,null,39569.51]
[null,"Ebara",0,75856.850000000006,75856.850000000006,{"$error":"#DIV/0!"},null,null,null,"Ebara",75856.850000000006,75856.850000000006,null,null,null,null,null,null,null,null,null,null,null,null,null,"Arredamenti Montegrappa",0]
{"$rows_left_out":87}
{"sheet":"BUDGET","index":2,"n_rows":112,"n_cols":24,"rows_kept":112,"cut":false,"hidden":false,"merged":[[1,0,1,8],[0,14,1,15]]}
[null,null,null,null,null,null,null,null,null,null,null,null,null,null,"BUDGET  ANNUALE DEGLI ACQUISTI"]
["BUDGET MENSILE DEGLI ACQUISTI"]
["FORNITORE","GEN 22","FEB 22","MAR 22","APR 22","MAG 22","GIU 22","LUG 22","AGO 22","SET 22","OTT 22","NOV 22","DIC 22",null,"FORNITORE","BUDGET 2022",null,null,null,null,"GEN-MAR","APR-GIU","LUG-SET","OTT-DIC"]
[{"$f":"IF(O4=0,\"\",O4)","v":"Geberit"},{"$f":"IFERROR(VLOOKUP(A4,STAGIONALITA!$A$3:$M$105,2,FALSE)*P4,\"\")","v":55658.654946289935},{"$f":"IFERROR(VLOOKUP(A4,STAGIONALITA!$A$3:$M$105,3,FALSE)*P4,\"\")","v":83623.419351851087},{"$f":"IFERROR(VLOOKUP(A4,STAGIONALITA!$A$3:$M$105,4,FALSE)*P4,\"\")","v":86504.885516758499},{"$f":"IFERROR(VLOOKUP(A4,STAGIONALITA!$A$3:$M$105,5,FALSE)*P4,\"\")","v":62180.10877339312},{"$f":"IFERROR(VLOOKUP(A4,STAGIONALITA!$A$3:$M$105,6,FALSE)*P4,\"\")","v":61699.714646194567},{"$f":"IFERROR(VLOOKUP(A4,STAGIONALITA!$A$3:$M$105,7,FALSE)*P4,\"\")","v":77431.49470800448},{"$f":"IFERROR(VLOOKUP(A4,STAGIONALITA!$A$3:$M$105,8,FALSE)*P4,\"\")","v":69474.409397289433},{"$f":"IFERROR(VLOOKUP(A4,STAGIONALITA!$A$3:$M$105,9,FALSE)*P4,\"\")","v":33940.226430774463},{"$f":"IFERROR(VLOOKUP(A4,STAGIONALITA!$A$3:$M$105,10,FALSE)*P4,\"\")","v":56722.981138636664},{"$f":"IFERROR(VLOOKUP(A4,STAGIONALITA!$A$3:$M$105,11,FALSE)*P4,\"\")","v":82940.213334513377},{"$f":"IFERROR(VLOOKUP(A4,STAGIONALITA!$A$3:$M$105,12,FALSE)*P4,\"\")","v":88873.764835354435},{"$f":"IFERROR(VLOOKUP(A4,STAGIONALITA!$A$3:$M$105,13,FALSE)*P4,\"\")","v":40950.126920940042},null,"Geberit",800000,null,null,null,"ACQUISTI",{"$f":"ACQUISTI!L5+ACQUISTI!M5+ACQUISTI!N5","v":1033305.776},{"$f":"U4+ACQUISTI!O5+ACQUISTI!P5+ACQUISTI!Q5","v":1033305.776},{"$f":"V4+ACQUISTI!R5+ACQUISTI!S5+ACQUISTI!T5","v":1033305.776},{"$f":"W4+ACQUISTI!U5+ACQUISTI!V5+ACQUISTI!W5","v":1033305.776}]
["Immergas ",{"$f":"IFERROR(VLOOKUP(A5,STAGIONALITA!$A$3:$M$105,2,FALSE)*P5,\"\")","v":32120.644048927708},{"$f":"IFERROR(VLOOKUP(A5,STAGIONALITA!$A$3:$M$105,3,FALSE)*P5,\"\")","v":59954.897977896733},{"$f":"IFERROR(VLOOKUP(A5,STAGIONALITA!$A$3:$M$105,4,FALSE)*P5,\"\")","v":77271.774184353315},{"$f":"IFERROR(VLOOKUP(A5,STAGIONALITA!$A$3:$M$105,5,FALSE)*P5,\"\")","v":46900.383469667082},{"$f":"IFERROR(VLOOKUP(A5,STAGIONALITA!$A$3:$M$105,6,FALSE)*P5,\"\")","v":42674.159887011512},{"$f":"IFERROR(VLOOKUP(A5,STAGIONALITA!$A$3:$M$105,7,FALSE)*P5,\"\")","v":71249.687560438222},{"$f":"IFERROR(VLOOKUP(A5,STAGIONALITA!$A$3:$M$105,8,FALSE)*P5,\"\")","v":37486.144194128407},{"$f":"IFERROR(VLOOKUP(A5,STAGIONALITA!$A$3:$M$105,9,FALSE)*P5,\"\")","v":8997.6707130042196},{"$f":"IFERROR(VLOOKUP(A5,STAGIONALITA!$A$3:$M$105,10,FALSE)*P5,\"\")","v":80218.567966893577},{"$f":"IFERROR(VLOOKUP(A5,STAGIONALITA!$A$3:$M$105,11,FALSE)*P5,\"\")","v":92838.521065983892},{"$f":"IFERROR(VLOOKUP(A5,STAGIONALITA!$A$3:$M$105,12,FALSE)*P5,\"\")","v":134776.92945318215},{"$f":"IFERROR(VLOOKUP(A5,STAGIONALITA!$A$3:$M$105,13,FALSE)*P5,\"\")","v":65510.619478513072},null,"Immergas ",750000,null,null,null,"BUDGET",{"$f":"SUM(B4:D106)","v":2099470.3480083193},{"$f":"U5+SUM(E4:G106)","v":4076555.7355788331},{"$f":"V5+SUM(H4:J106)","v":5653930.6671507042},{"$f":"W5+SUM(K4:M106)","v":7596000.0000000028}]
["Ariston ",{"$f":"IFERROR(VLOOKUP(A6,STAGIONALITA!$A$3:$M$105,2,FALSE)*P6,\"\")","v":42476.064897828299},{"$f":"IFERROR(VLOOKUP(A6,STAGIONALITA!$A$3:$M$105,3,FALSE)*P6,\"\")","v":64757.748191954102},{"$f":"IFERROR(VLOOKUP(A6,STAGIONALITA!$A$3:$M$105,4,FALSE)*P6,\"\")","v":51381.921678680243},{"$f":"IFERROR(VLOOKUP(A6,STAGIONALITA!$A$3:$M$105,5,FALSE)*P6,\"\")","v":52158.34812056493},{"$f":"IFERROR(VLOOKUP(A6,STAGIONALITA!$A$3:$M$105,6,FALSE)*P6,\"\")","v":49557.012448238886},{"$f":"IFERROR(VLOOKUP(A6,STAGIONALITA!$A$3:$M$105,7,FALSE)*P6,\"\")","v":55626.065547495316},{"$f":"IFERROR(VLOOKUP(A6,STAGIONALITA!$A$3:$M$105,8,FALSE)*P6,\"\")","v":46512.764941723653},{"$f":"IFERROR(VLOOKUP(A6,STAGIONALITA!$A$3:$M$105,9,FALSE)*P6,\"\")","v":7499.0963543636681},{"$f":"IFERROR(VLOOKUP(A6,STAGIONALITA!$A$3:$M$105,10,FALSE)*P6,\"\")","v":43630.71455855394},{"$f":"IFERROR(VLOOKUP(A6,STAGIONALITA!$A$3:$M$105,11,FALSE)*P6,\"\")","v":54099.45951908375},{"$f":"IFERROR(VLOOKUP(A6,STAGIONALITA!$A$3:$M$105,12,FALSE)*P6,\"\")","v":32417.863005157673},{"$f":"IFERROR(VLOOKUP(A6,STAGIONALITA!$A$3:$M$105,13,FALSE)*P6,\"\")","v":29882.940736355533},null,"Ariston ",530000,null,null,null,"Δ € ",{"$f":"U4-U5","v":-1066164.5720083192},{"$f":"V4-V5","v":-3043249.9595788331},{"$f":"W4-W5","v":-4620624.8911507046},{"$f":"X4-X5","v":-6562694.2240000032}]
["Giacomini",{"$f":"IFERROR(VLOOKUP(A7,STAGIONALITA!$A$3:$M$105,2,FALSE)*P7,\"\")","v":44302.197628437098},{"$f":"IFERROR(VLOOKUP(A7,STAGIONALITA!$A$3:$M$105,3,FALSE)*P7,\"\")","v":33842.84306716967},{"$f":"IFERROR(VLOOKUP(A7,STAGIONALITA!$A$3:$M$105,4,FALSE)*P7,\"\")","v":68887.136830820062},{"$f":"IFERROR(VLOOKUP(A7,STAGIONALITA!$A$3:$M$105,5,FALSE)*P7,\"\")","v":33100.732800114783},{"$f":"IFERROR(VLOOKUP(A7,STAGIONALITA!$A$3:$M$105,6,FALSE)*P7,\"\")","v":34681.021355932142},{"$f":"IFERROR(VLOOKUP(A7,STAGIONALITA!$A$3:$M$105,7,FALSE)*P7,\"\")","v":47708.337220084592},{"$f":"IFERROR(VLOOKUP(A7,STAGIONALITA!$A$3:$M$105,8,FALSE)*P7,\"\")","v":46781.039500504237},{"$f":"IFERROR(VLOOKUP(A7,STAGIONALITA!$A$3:$M$105,9,FALSE)*P7,\"\")","v":13520.358004437187},{"$f":"IFERROR(VLOOKUP(A7,STAGIONALITA!$A$3:$M$105,10,FALSE)*P7,\"\")","v":28435.136883689735},{"$f":"IFERROR(VLOOKUP(A7,STAGIONALITA!$A$3:$M$105,11,FALSE)*P7,\"\")","v":51034.36565802883},{"$f":"IFERROR(VLOOKUP(A7,STAGIONALITA!$A$3:$M$105,12,FALSE)*P7,\"\")","v":44097.30255088886},{"$f":"IFERROR(VLOOKUP(A7,STAGIONALITA!$A$3:$M$105,13,FALSE)*P7,\"\")","v":33609.528499892767},null,"Giacomini",480000]
["Valsir",{"$f":"IFERROR(VLOOKUP(A8,STAGIONALITA!$A$3:$M$105,2,FALSE)*P8,\"\")","v":45803.001999182852},{"$f":"IFERROR(VLOOKUP(A8,STAGIONALITA!$A$3:$M$105,3,FALSE)*P8,\"\")","v":39107.631782556287},{"$f":"IFERROR(VLOOKUP(A8,STAGIONALITA!$A$3:$M$105,4,FALSE)*P8,\"\")","v":58792.29340466889},{"$f":"IFERROR(VLOOKUP(A8,STAGIONALITA!$A$3:$M$105,5,FALSE)*P8,\"\")","v":33032.591930827904},{"$f":"IFERROR(VLOOKUP(A8,STAGIONALITA!$A$3:$M$105,6,FALSE)*P8,\"\")","v":38556.09745436674},{"$f":"IFERROR(VLOOKUP(A8,STAGIONALITA!$A$3:$M$105,7,FALSE)*P8,\"\")","v":41306.606311831478},{"$f":"IFERROR(VLOOKUP(A8,STAGIONALITA!$A$3:$M$105,8,FALSE)*P8,\"\")","v":42971.870183444553},{"$f":"IFERROR(VLOOKUP(A8,STAGIONALITA!$A$3:$M$105,9,FALSE)*P8,\"\")","v":5573.3118551995676},{"$f":"IFERROR(VLOOKUP(A8,STAGIONALITA!$A$3:$M$105,10,FALSE)*P8,\"\")","v":39823.243825414116},{"$f":"IFERROR(VLOOKUP(A8,STAGIONALITA!$A$3:$M$105,11,FALSE)*P8,\"\")","v":47609.689200494773},{"$f":"IFERROR(VLOOKUP(A8,STAGIONALITA!$A$3:$M$105,12,FALSE)*P8,\"\")","v":29580.963173831362},{"$f":"IFERROR(VLOOKUP(A8,STAGIONALITA!$A$3:$M$105,13,FALSE)*P8,\"\")","v":27842.698878181502},null,"Valsir",450000]
["General Fittings ",{"$f":"IFERROR(VLOOKUP(A9,STAGIONALITA!$A$3:$M$105,2,FALSE)*P9,\"\")","v":0},{"$f":"IFERROR(VLOOKUP(A9,STAGIONALITA!$A$3:$M$105,3,FALSE)*P9,\"\")","v":109443.0627617063},{"$f":"IFERROR(VLOOKUP(A9,STAGIONALITA!$A$3:$M$105,4,FALSE)*P9,\"\")","v":18522.676527344142},{"$f":"IFERROR(VLOOKUP(A9,STAGIONALITA!$A$3:$M$105,5,FALSE)*P9,\"\")","v":25693.521766324353},{"$f":"IFERROR(VLOOKUP(A9,STAGIONALITA!$A$3:$M$105,6,FALSE)*P9,\"\")","v":37538.716660743448},{"$f":"IFERROR(VLOOKUP(A9,STAGIONALITA!$A$3:$M$105,7,FALSE)*P9,\"\")","v":27811.088486170476},{"$f":"IFERROR(VLOOKUP(A9,STAGIONALITA!$A$3:$M$105,8,FALSE)*P9,\"\")","v":0},{"$f":"IFERROR(VLOOKUP(A9,STAGIONALITA!$A$3:$M$105,9,FALSE)*P9,\"\")","v":29796.424218544693},{"$f":"IFERROR(VLOOKUP(A9,STAGIONALITA!$A$3:$M$105,10,FALSE)*P9,\"\")","v":45454.651078419163},{"$f":"IFERROR(VLOOKUP(A9,STAGIONALITA!$A$3:$M$105,11,FALSE)*P9,\"\")","v":29658.503318886451},{"$f":"IFERROR(VLOOKUP(A9,STAGIONALITA!$A$3:$M$105,12,FALSE)*P9,\"\")","v":11163.061218678455},{"$f":"IFERROR(VLOOKUP(A9,STAGIONALITA!$A$3:$M$105,13,FALSE)*P9,\"\")","v":14918.293963182572},null,"General Fittings ",350000]
["Bosch",{"$f":"IFERROR(VLOOKUP(A10,STAGIONALITA!$A$3:$M$105,2,FALSE)*P10,\"\")","v":24738.921009412181},{"$f":"IFERROR(VLOOKUP(A10,STAGIONALITA!$A$3:$M$105,3,FALSE)*P10,\"\")","v":16938.486301083842},{"$f":"IFERROR(VLOOKUP(A10,STAGIONALITA!$A$3:$M$105,4,FALSE)*P10,\"\")","v":32256.858566158942},{"$f":"IFERROR(VLOOKUP(A10,STAGIONALITA!$A$3:$M$105,5,FALSE)*P10,\"\")","v":36900.92466478944},{"$f":"IFERROR(VLOOKUP(A10,STAGIONALITA!$A$3:$M$105,6,FALSE)*P10,\"\")","v":24405.425406756174},{"$f":"IFERROR(VLOOKUP(A10,STAGIONALITA!$A$3:$M$105,7,FALSE)*P10,\"\")","v":19076.596500256604},{"$f":"IFERROR(VLOOKUP(A10,STAGIONALITA!$A$3:$M$105,8,FALSE)*P10,\"\")","v":25472.733587409111},{"$f":"IFERROR(VLOOKUP(A10,STAGIONALITA!$A$3:$M$105,9,FALSE)*P10,\"\")","v":4512.4501652829122},{"$f":"IFERROR(VLOOKUP(A10,STAGIONALITA!$A$3:$M$105,10,FALSE)*P10,\"\")","v":33851.10845854754},{"$f":"IFERROR(VLOOKUP(A10,STAGIONALITA!$A$3:$M$105,11,FALSE)*P10,\"\")","v":76759.707098114159},{"$f":"IFERROR(VLOOKUP(A10,STAGIONALITA!$A$3:$M$105,12,FALSE)*P10,\"\")","v":27387.414647409554},{"$f":"IFERROR(VLOOKUP(A10,STAGIONALITA!$A$3:$M$105,13,FALSE)*P10,\"\")","v":17699.373594779503},null,"Bosch",340000]
{"$rows_left_out":103}
{"sheet":"STAGIONALITA","index":3,"n_rows":96,"n_cols":28,"rows_kept":96,"cut":false,"hidden":false,"merged":[[0,0,0,12],[0,15,0,27]]}
["STAGIONALITA' 2021 GRUPPO DELTA",null,null,null,null,null,null,null,null,null,null,null,null,null,null,"STAGIONALITA' 2021 SOCIO"]
["Fornitori","GEN 21 ","FEB 21 ","MAR 21 ","APR 21 ","MAG 21 ","GIU 21","LUG 21 ","AGO 21 ","SET 21 ","OTT 21 ","NOV 21 ","DIC 21 ",null,null,"Fornitori","GEN 21 ","FEB 21 ","MAR 21 ","APR 21 ","MAG 21 ","GIU 21","LUG 21 ","AGO 21 ","SET 21 ","OTT 21 ","NOV 21 ","DIC 21 "]
["Albatros",6.5824738952378909E-3,5.6712193657668473E-3,0.2138982396706619,5.442869701322927E-2,0.16969703467055469,7.5258903492785006E-3,0.13854285040416819,5.9574604944359871E-2,9.9326743712343749E-2,1.0999378202791656E-2,0.11247025021977315,0.1212826175518343,null,null,"Arblu",6.0411829068640552E-2,5.6901992390300221E-2,8.9536549480124211E-2,9.3251996692413422E-2,5.7762727632000473E-2,0.12860387946674426,0.14205015193375883,5.1094725656077129E-3,0.12942639975173562,7.5726258059428814E-2,0.10774343650303606,5.3475306456209855E-2]
["Arbi Arredobagno",5.100171884245823E-3,6.9401786469046753E-2,9.2366648820761357E-2,5.3763137873707345E-2,7.8925864352334521E-2,0.1184028854011102,6.9937163628166474E-2,7.4811913550677678E-2,8.6139367127842426E-2,4.0998619290484373E-2,0.20843078136887486,0.10172166023274817,null,null,"Ariston ",0.14116631308975525,0.19854139774672713,0.10913451976585935,4.782153725361734E-2,0.11154093887669136,0.22009514403709443,4.398223795986124E-2,3.2007159932453385E-4,3.0619825525393875E-3,9.0819333247538894E-2,3.1613691875920467E-2,1.9028319950706086E-3]
["Arblu",4.1826374572185812E-2,6.9876167432293315E-2,0.11367076780299863,0.10293303694971385,7.5748552989291687E-2,0.10491476320273048,0.1176450050651676,2.3321699583297925E-2,0.10156076647433536,7.0969220415240578E-2,8.3320341421968036E-2,9.4213304090776676E-2,null,null,"Bosch",1.0740688892354652E-2,1.1187718580129388E-2,4.1104050070637034E-2,0.28649368862213204,0,0,2.4650773026908178E-2,0,0.18163147117390419,0.42834939440592168,0,1.5842215228012879E-2]
["Ariston ",8.014351867514774E-2,0.1221844305508568,9.6947022035245745E-2,9.8411977585971561E-2,9.3503797072148842E-2,0.10495484065565154,8.7759933852308777E-2,1.4149238404459752E-2,8.2322102940667816E-2,0.10207445192279953,6.1165779255014478E-2,5.638290704972742E-2,null,null,"Bossini ",0,0,1,0,0,0,0,0,0,0,0,0]
["Arredamenti Montegrappa",0.11033570951517713,3.2957596739678609E-2,0.13291707815131154,3.7165582247158435E-2,5.639394476337517E-2,0.19369929755389165,4.213375594923157E-2,2.973097887705272E-2,0.18942687881720419,7.697850284435534E-2,2.4297522914067157E-2,7.3963151627496629E-2,null,null,"Bwt/Cillichemie",0,4.3007587295734097E-2,0.23779827430467868,0.30603900399894018,0,0,0.27552248842228555,0,0,0,0.13763264597836147,0]
["Atusa",5.6371023468408971E-2,6.8313433774368909E-2,8.1946902429789956E-2,5.8097404013741569E-2,6.8139936234995091E-2,0.11781256898352496,7.7080266850748452E-2,4.8328942213589188E-2,0,0.13587615577689141,0.12341717754124022,0.16461618871270128,null,null,"Caleffi",7.5478963408950495E-2,3.5399439915642365E-2,0.10684501597133964,7.7398909787590953E-2,5.16947705246232E-2,0.1639004224953432,0.10361432048576352,0,0.10036626834207708,5.3629502204616972E-2,0.17501982623199594,5.6652560632056648E-2]
["Bernasconi ",0.13548624099059325,5.6484108680029878E-2,6.7513459687043254E-2,6.4844088175818063E-2,6.9769752997169879E-2,0.19693477299559431,0.11597818941169558,2.0025770328964819E-2,0.10580812109964768,6.6151057525400722E-2,5.1433868247618343E-2,4.9570569860424171E-2,null,null,"Carlo Nobili ",0,0.36265235182822192,3.2604391252695031E-3,2.9863158357900293E-2,0.1085361024332292,3.3295199542394509E-2,0.16045672548070578,7.101685220222643E-3,7.0282043384520612E-2,2.5705108461301536E-2,0.17666651999823998,2.2180666167994016E-2]
["Beza",0,0,0,0,0,0,0,0,0,0,0,1,null,null,"Cordivari ",5.4804933842625907E-2,3.3557248275171384E-2,4.7855263439167274E-2,6.2865388760119947E-2,7.4155755917676786E-2,0.14208909715970158,0.18372188629498448,9.9857819462946917E-2,7.7299594805295885E-2,5.4764386645076733E-2,0.10238402912672273,6.6644596270510378E-2]
{"$rows_left_out":87}
{"sheet":"PREMI","index":4,"n_rows":102,"n_cols":7,"rows_kept":102,"cut":false,"hidden":false,"merged":[[0,1,2,6]]}
[null,"STIMA PREMI AD OGGI"]
[]
[]
["SOCIO","FORNITORE","Fatt. Progr.2022 ","Coordinamento","Incondizionato","Premio a Target","Totale premi"]
["RAFFAELE SpA",null,1033305.776,null,null,null,{"$f":"SUM(G6:G102)","v":0}]
[null,"Arblu",8399.7800000000007,{"$f":"IFERROR(VLOOKUP(B6,'[1]FATT+ORD+P.O.'!$A$3:$I$96,6,FALSE),\"\")","v":0},{"$f":"IFERROR(VLOOKUP(B6,'[1]FATT+ORD+P.O.'!$A$3:$I$96,7,FALSE),\"\")","v":0},{"$f":"IFERROR(VLOOKUP(B6,'[1]FATT+ORD+P.O.'!$A$3:$I$96,8,FALSE),\"\")","v":0},{"$f":"IFERROR(C6*(D6+E6+F6),\"\")","v":0}]
[null,"Ariston ",39569.51,{"$f":"IFERROR(VLOOKUP(B7,'[1]FATT+ORD+P.O.'!$A$3:$I$96,6,FALSE),\"\")","v":0},{"$f":"IFERROR(VLOOKUP(B7,'[1]FATT+ORD+P.O.'!$A$3:$I$96,7,FALSE),\"\")","v":0},{"$f":"IFERROR(VLOOKUP(B7,'[1]FATT+ORD+P.O.'!$A$3:$I$96,8,FALSE),\"\")","v":0},{"$f":"IFERROR(C7*(D7+E7+F7),\"\")","v":0}]
[null,"Bosch",34199.31,{"$f":"IFERROR(VLOOKUP(B8,'[1]FATT+ORD+P.O.'!$A$3:$I$96,6,FALSE),\"\")","v":0},{"$f":"IFERROR(VLOOKUP(B8,'[1]FATT+ORD+P.O.'!$A$3:$I$96,7,FALSE),\"\")","v":0},{"$f":"IFERROR(VLOOKUP(B8,'[1]FATT+ORD+P.O.'!$A$3:$I$96,8,FALSE),\"\")","v":0},0]
[null,"Bwt/Cillichemie",355,{"$f":"IFERROR(VLOOKUP(B9,'[1]FATT+ORD+P.O.'!$A$3:$I$96,6,FALSE),\"\")","v":0},{"$f":"IFERROR(VLOOKUP(B9,'[1]FATT+ORD+P.O.'!$A$3:$I$96,7,FALSE),\"\")","v":0},{"$f":"IFERROR(VLOOKUP(B9,'[1]FATT+ORD+P.O.'!$A$3:$I$96,8,FALSE),\"\")","v":0},0]
[null,"Caleffi",2988.57,{"$f":"IFERROR(VLOOKUP(B10,'[1]FATT+ORD+P.O.'!$A$3:$I$96,6,FALSE),\"\")","v":0},{"$f":"IFERROR(VLOOKUP(B10,'[1]FATT+ORD+P.O.'!$A$3:$I$96,7,FALSE),\"\")","v":0},{"$f":"IFERROR(VLOOKUP(B10,'[1]FATT+ORD+P.O.'!$A$3:$I$96,8,FALSE),\"\")","v":0},0]
{"$rows_left_out":92}